Perl 6 - the future is here, just unevenly distributed

IRC log for #gluster-dev, 2017-10-31

| Channels | #gluster-dev index | Today | | Search | Google Search | Plain-Text | summary

All times shown according to UTC.

Time Nick Message
00:11 major joined #gluster-dev
01:51 prasanth joined #gluster-dev
02:36 BlackoutWNCT joined #gluster-dev
02:56 ilbot3 joined #gluster-dev
02:56 Topic for #gluster-dev is now Gluster Development Channel - https://www.gluster.org | For general chat go to #gluster | Patches - https://review.gluster.org/ | Channel Logs - https://botbot.me/freenode/gluster-dev/ & http://irclog.perlgeek.de/gluster-dev/
03:05 gyadav_ joined #gluster-dev
03:20 skoduri joined #gluster-dev
03:35 anoopcs joined #gluster-dev
03:53 mchangir joined #gluster-dev
04:00 psony joined #gluster-dev
04:24 decayofmind joined #gluster-dev
04:25 ndk_ joined #gluster-dev
04:31 Saravanakmr joined #gluster-dev
04:42 ketan joined #gluster-dev
04:42 ketan hi all
04:43 ketan i have been building glusterFS from source v 3.10.6
04:43 ketan i am facing issues with running test cases
04:43 ketan teh test cases seem to fail on intel machine
04:43 ketan wanted to know if this is a known issue
04:43 ketan or how can it be resolved
04:46 vaibhav joined #gluster-dev
04:49 skumar joined #gluster-dev
04:49 atinm joined #gluster-dev
04:50 aravindavk joined #gluster-dev
04:50 pkalever joined #gluster-dev
05:00 vaibhav Hey! I have built GlusterFS from source and while executing run-tests.sh encountered some error while running tests in file ./tests/basic/0symbol-check.t
05:00 vaibhav any help will be appreciated
05:12 ndarshan joined #gluster-dev
05:13 gobindadas joined #gluster-dev
05:27 karthik_us joined #gluster-dev
05:27 sunny joined #gluster-dev
05:40 hgowtham joined #gluster-dev
05:49 skumar_ joined #gluster-dev
05:53 Saravanakmr joined #gluster-dev
06:02 mchangir vaibhav, can you paste the errors ?
06:06 amarts joined #gluster-dev
06:22 skumar__ joined #gluster-dev
06:26 xavih joined #gluster-dev
06:26 pranithk1 joined #gluster-dev
06:29 vaibhav here is the complete log
06:29 vaibhav ~/glusterfs# ./run-tests.sh  ... GlusterFS Test Framework ...  ~/glusterfs ~/glusterfs ~/glusterfs  ================================================================================ [05:28:42] Running tests in file ./tests/basic/0symbol-check.t ./tests/basic/0symbol-check.t .. 1..2 ./xlators/mgmt/glusterd/src/.libs/glusterd_la-glusterd-snapshot.o should call sys_lstat, not lstat ok 1, LINENUM:40 not ok 2 , LINENUM:42 FAILED COM
06:29 vaibhav Failed 1/2 subtests  Test Summary Report ------------------- ./tests/basic/0symbol-check.t (Wstat: 0 Tests: 2 Failed: 1)   Failed test:  2 Files=1, Tests=2, 12 wallclock secs ( 0.03 usr  0.02 sys +  8.48 cusr  1.16 csys =  9.69 CPU) Result: FAIL ./tests/basic/0symbol-check.t: bad status 1         *********************************        *       REGRESSION FAILED       *        * Retrying failed tests in case *        * we got
06:29 glusterbot vaibhav: -----------------'s karma is now -3
06:30 vaibhav ./tests/basic/0symbol-check.t .. 1..2 ./xlators/mgmt/glusterd/src/.libs/glusterd_la-glusterd-snapshot.o should call sys_lstat, not lstat ok 1, LINENUM:40 not ok 2 , LINENUM:42
06:30 vaibhav FAILED COMMAND: [ ! -e ./.symbol-check-errors ] Failed 1/2 subtests  Test Summary Report ------------------- ./tests/basic/0symbol-check.t (Wstat: 0 Tests: 2 Failed: 1)   Failed test:  2 Files=1, Tests=2, 13 wallclock secs ( 0.04 usr  0.01 sys +  9.44 cusr  1.21 csys = 10.70 CPU) Result: FAIL End of test ./tests/basic/0symbol-check.t
06:30 glusterbot vaibhav: -----------------'s karma is now -4
06:30 msvbhat joined #gluster-dev
06:59 mchangir vaibhav, have you made changes to the sources ?
07:00 vaibhav no
07:00 mchangir vaibhav, 0symbol-check.t should not have failed
07:01 msvbhat joined #gluster-dev
07:02 vaibhav make -> make install -> ./run-tests.sh
07:02 mchangir vaibhav, hold on
07:03 vaibhav glusterfs version is 3.10.6
07:05 mchangir vaibhav, yeah, I can see an lstat() there; could you change that occurance of lstat() in glusterd_remove_trashpath() to sys_lstat() and rebuild, reinstall ?
07:06 vaibhav sure will try that
07:14 vaibhav great! that really helped. thanks mchangir
07:17 mchangir joined #gluster-dev
07:41 atinm pranithk1, hey, needyour review on the reset-brick patch
07:46 pranithk1 atinm: will do
08:16 Venkata joined #gluster-dev
08:36 ndevos skoduri: which was the 3.12 patch that you wanted in the testing repo?
08:42 skoduri ndevos, https://review.gluster.org/18524
08:43 ndevos skoduri: thanks!
08:43 skoduri ndevos++ thanks a lot for making the build..I updated ci-tests pull request
08:43 glusterbot skoduri: ndevos's karma is now 368
08:44 ndevos skoduri: yeah, I saw the github emails, but have not looked at the updated version yet
09:02 mchangir vaibhav, what type of system are you building for ? 32bit or 64bit ?
09:08 vaibhav 64bit
09:09 vaibhav further ./tests/basic/afr/arbiter-mount.t fails
09:10 DoubleJ_ joined #gluster-dev
09:11 vaibhav test 7, 17, 21 and 22 failed for ./tests/basic/afr/arbiter-mount.t
09:13 sunnyk joined #gluster-dev
09:13 mchangir vaibhav, could you run "cd tests; prove -vfe /usr/bin/bash ./basic/afr/arbiter-mount.t" again ? my guess is that the failure might have been a spurious one
09:18 vaibhav it failed again
09:22 sunny joined #gluster-dev
09:29 mchangir vaibhav, hmm
09:29 mchangir vaibhav, what OS are you building on ?
09:30 vaibhav ubuntu
09:30 vaibhav 16.04
09:31 mchangir vaibhav, what's the gcc version ?
09:31 DoubleJ joined #gluster-dev
09:33 vaibhav 5.4.0
09:40 vaibhav mchangir, any additional setup required to run tests other than that specified in readme.md?
09:44 foster joined #gluster-dev
09:50 pranithk1 joined #gluster-dev
10:00 JoeJulian_ joined #gluster-dev
10:06 decayofmind joined #gluster-dev
10:10 Shu6h3ndu joined #gluster-dev
10:18 pranithk1 joined #gluster-dev
10:30 msvbhat joined #gluster-dev
10:34 shyam joined #gluster-dev
11:10 mchangir vaibhav, do you have nfs-utils package installed and the nfsd service enabled and started in your setup ?
11:10 mchangir vaibhav, sorry, please ignore that
11:11 pkalever joined #gluster-dev
11:12 mchangir vaibhav, you definitely need nfs-utils package
11:15 mchangir vaibhav, please do not enable and start nfsd service on your system; ./basic/afr/arbiter-mount.t is testing gluster-nfs service along with arbiter tests
11:18 gyadav__ joined #gluster-dev
11:36 msvbhat joined #gluster-dev
12:24 devyani7 joined #gluster-dev
12:36 msvbhat joined #gluster-dev
12:53 shyam joined #gluster-dev
12:57 rraja joined #gluster-dev
13:34 vbellur joined #gluster-dev
13:34 vbellur1 joined #gluster-dev
13:35 vbellur joined #gluster-dev
13:36 vbellur joined #gluster-dev
13:37 vbellur1 joined #gluster-dev
13:38 vbellur joined #gluster-dev
13:38 msvbhat joined #gluster-dev
14:10 shyam joined #gluster-dev
14:16 shyam joined #gluster-dev
14:22 msvbhat_ joined #gluster-dev
14:29 vbellur joined #gluster-dev
14:31 vbellur1 joined #gluster-dev
14:32 vbellur joined #gluster-dev
14:33 vbellur1 joined #gluster-dev
14:34 vbellur joined #gluster-dev
14:35 vbellur joined #gluster-dev
14:37 psony|Tea joined #gluster-dev
15:05 wushudoin joined #gluster-dev
15:06 wushudoin joined #gluster-dev
15:06 sunny joined #gluster-dev
15:22 msvbhat joined #gluster-dev
15:24 aravindavk joined #gluster-dev
15:51 major joined #gluster-dev
15:57 Shu6h3ndu joined #gluster-dev
16:14 msvbhat joined #gluster-dev
16:15 rraja joined #gluster-dev
16:38 pranithk1 joined #gluster-dev
16:48 Shu6h3ndu joined #gluster-dev
17:41 pkalever joined #gluster-dev
17:48 vbellur joined #gluster-dev
18:31 vbellur joined #gluster-dev
19:05 Acinonyx joined #gluster-dev
19:41 vbellur joined #gluster-dev
20:05 vbellur joined #gluster-dev
20:07 vbellur joined #gluster-dev
20:24 vbellur joined #gluster-dev
20:43 vbellur joined #gluster-dev
20:58 vbellur joined #gluster-dev
21:20 purpleidea joined #gluster-dev

| Channels | #gluster-dev index | Today | | Search | Google Search | Plain-Text | summary